{"text_format":"3","workbook":"xlsx","n_sheets":4,"sheets":["Rangliste","Rang","Abfragen","Makros"],"not_rendered":{"macros":1,"defined_names":3},"read":"whole","date_system":"1900"}

{"sheet":"Rangliste","index":0,"n_rows":55,"n_cols":120,"rows_kept":55}
["Name","Vorname","Pass-Nr.","Team","Klasse","Gesamt","Spiele","ø","Pins","Pins","Pins","Pins","Pins","Pins","Pins","Pins","Pins","Pins","Pins","Pins","Pins","Pins","Pins","Pins","Pins","Pins","Pins","Pins","Pins","Pins","Pins","Pins","Pins","Pins","Pins","Pins","Pins","Pins","Pins","Pins","Pins","Pins","Pins","Pins","Pins","Pins","Pins","Pins","Pins","Pins","Pins","Pins","Pins","Pins","Pins","Pins","Pins","Pins","Pins","Pins","Pins","Pins","Pins","Pins","Pins","Pins","Pins","Pins","Pins","Pins","Pins","Pins","Pins","Pins","Pins","Pins","Pins","Pins","Pins","Pins","Pins","Pins","Pins","Pins","Pins","Pins","Pins","Pins","Pins","Pins","Pins","Pins","Pins","Pins","Pins","Pins","Pins","Pins","Pins","Pins","Pins","Pins","Pins","Pins","Pins","Pins","Pins","Pins","Pins","Pins","Pins","Pins","Pins","Pins","Pins","Pins",{"$f":"COUNTA(A:A)+1","v":56},"HL","G",{"$f":"COUNTA(A:A)","v":55}]
["Harzer"," Christopher","030/16","Gassenhauer","HL",{"$f":"ROUND(SUM(I2:CU2),0)","v":{"v":10064,"d":"10,064"}},{"$f":"COUNTA(I2:CU2)","v":54},{"$f":"ROUND(AVERAGE(I2:CU2),3)","v":186.37},198,158,184,206,201,220,224,200,182,170,176,164,211,156,167,216,199,215,180,172,188,211,155,215,212,158,160,186,139,187,146,165,159,161,210,201,152,170,193,179,167,144,267,194,231,204,202,204,214,190,229,171,167,134,{"$nulls":54},{"$f":"COUNTA(I2:DL2)+9","v":63},null,"M"]
["Brookes-Kiefer"," Elaine","028/08","Gassenhauer","HL",{"$f":"ROUND(SUM(I3:CU3),0)","v":{"v":10951,"d":"10,951"}},65,{"v":168.477,"d":"168.48"},147,202,203,200,126,172,173,189,138,180,154,191,160,129,182,214,136,174,178,185,158,166,165,155,148,154,141,126,146,188,169,184,222,144,162,211,153,158,215,142,161,212,126,185,133,174,189,182,165,168,206,135,183,170,182,140,171,148,171,155,172,211,145,161,166,{"$nulls":43},74,null,"W"]
["Lella"," Michele","059/14","Gassenhauer","HL",{"v":6273,"d":"6,273"},36,174.25,183,182,171,110,182,186,175,190,126,126,206,114,161,190,191,197,151,219,208,179,181,144,210,154,214,160,157,134,150,135,189,172,189,245,209,183,{"$nulls":72},45,null,"M"]
["Kiefer"," Michael","029/08","Gassenhauer","HL",{"v":15369,"d":"15,369"},{"$f":"COUNTA(I5:CU5)","v":83},{"$f":"ROUND(AVERAGE(I5:CU5),3)","v":{"v":185.169,"d":"185.17"}},161,159,207,167,178,163,227,161,250,193,211,194,189,193,151,224,221,176,213,187,181,183,188,200,158,178,154,193,164,165,214,172,189,182,162,192,206,188,188,178,174,201,172,189,162,196,171,178,232,180,208,181,179,177,192,191,201,140,158,154,152,160,201,185,146,175,186,161,264,197,180,171,192,158,221,201,182,200,237,167,195,153,189,{"$nulls":25},92,null,"M"]
["Vorwerg"," Michael","083/14","Gassenhauer","HL",{"$f":"ROUND(SUM(I6:CU6),0)","v":{"v":10551,"d":"10,551"}},60,175.85,186,167,233,145,163,191,167,194,145,149,154,231,183,149,152,157,191,203,149,147,171,159,200,195,160,190,161,194,155,232,204,181,248,180,173,212,193,141,174,182,170,208,163,167,172,157,178,152,144,178,157,178,177,176,142,205,212,152,167,135,{"$nulls":48},69,null,"M"]
["Scharnowski"," Waldemar","127/94","Wellenmacher 1","HL",{"v":8812,"d":"8,812"},45,{"v":195.822,"d":"195.82"},161,300,155,232,159,155,166,182,183,164,201,266,213,195,214,215,173,206,245,202,239,139,211,192,146,210,192,169,236,179,216,234,212,203,167,204,191,199,183,223,224,172,167,147,170,{"$nulls":63},54,null,"M"]
["Koths"," Katrin","105/16","Wellenmacher 1","HL",{"v":7855,"d":"7,855"},47,{"v":167.128,"d":"167.13"},169,148,170,182,145,142,177,169,159,220,169,182,178,145,184,162,207,195,146,116,152,173,148,187,189,156,157,144,203,125,200,167,166,143,141,242,177,156,145,203,158,152,138,136,189,142,201,{"$nulls":61},56,null,"W"]
["Gehrmann"," René","063/14","Wellenmacher 1","HL",{"v":12386,"d":"12,386"},62,{"v":199.774,"d":"199.77"},194,148,214,203,181,204,224,247,219,235,227,214,212,269,175,173,192,193,217,228,231,190,182,200,195,162,203,191,191,263,183,145,225,216,161,151,232,190,182,165,183,208,161,245,214,203,207,181,195,162,150,246,185,224,201,203,236,248,195,157,187,168,{"$nulls":46},71,null,"M"]
["Fabian"," Ingo","064/14","Wellenmacher 1","HL",{"$f":"ROUND(SUM(I10:CU10),0)","v":{"v":1925,"d":"1,925"}},12,{"v":160.417,"d":"160.42"},138,149,175,203,180,171,161,137,135,161,173,142,{"$nulls":96},21,null,"M"]
["Brückner"," Sylvia","102/23","MM Bau 1","HL",{"v":5805,"d":"5,805"},36,161.25,169,170,148,150,190,142,139,175,180,166,140,190,158,136,168,188,181,157,198,163,160,114,169,159,156,143,147,194,152,125,156,179,168,140,144,191,{"$nulls":72},45,null,"W"]
["Vogel"," Bernd","122/12","MM Bau 1","HL",{"v":7659,"d":"7,659"},45,{"v":170.2,"d":"170.20"},174,180,159,146,186,171,223,191,177,105,139,178,153,156,179,159,186,172,234,178,161,211,121,170,154,201,140,193,163,159,183,183,167,159,169,159,179,140,184,192,173,159,163,168,162,{"$nulls":63},54,null,"M"]
["Haase"," Reiner","104/15","MM Bau 1","HL",{"v":10277,"d":"10,277"},{"$f":"COUNTA(I13:CU13)","v":54},{"$f":"ROUND(AVERAGE(I13:CU13),3)","v":{"v":190.315,"d":"190.32"}},194,200,215,204,256,223,194,170,150,239,202,202,181,201,215,190,163,196,211,180,169,225,153,156,248,215,226,168,152,126,192,189,168,170,232,171,183,236,179,160,236,165,182,210,162,153,125,210,182,168,144,201,225,210,{"$nulls":54},63,null,"M"]
["Malow"," Marco","101/15","MM Bau 1","HL",{"v":16311,"d":"16,311"},83,{"v":196.518,"d":"196.52"},189,204,199,172,142,192,235,205,244,199,227,169,211,159,212,214,215,208,192,179,158,215,197,183,202,178,182,168,226,215,220,171,149,215,198,203,223,233,202,180,247,205,173,160,203,215,196,217,203,171,266,155,150,151,181,224,195,237,242,189,204,195,213,192,215,225,236,233,230,193,192,145,126,222,225,155,160,198,193,137,222,181,154,{"$nulls":25},92,null,"M"]
["Brötz"," Heinz","090/22","MM Bau 1","HL",{"$f":"ROUND(SUM(I15:CU15),0)","v":945},{"$f":"COUNTA(I15:CU15)","v":6},{"$f":"ROUND(AVERAGE(I15:CU15),3)","v":{"v":157.5,"d":"157.50"}},147,151,191,123,163,170,{"$nulls":102},15,null,"M"]
["Lipke"," Roswitha","118/11","Wellenmacher 2","HL",{"v":6482,"d":"6,482"},44,{"v":147.318,"d":"147.32"},153,134,104,160,159,107,133,170,116,166,138,155,159,167,174,129,147,114,170,152,191,145,159,139,157,131,167,154,138,151,152,146,149,196,171,123,113,122,123,164,123,138,197,126,{"$nulls":64},53,null,"W"]
["Roth"," Horst","092/17","Wellenmacher 2","HL",{"v":7920,"d":"7,920"},50,{"v":158.4,"d":"158.40"},204,176,145,116,164,152,156,183,137,213,149,197,158,152,164,153,156,145,143,147,168,151,136,164,183,159,139,206,169,155,159,175,135,140,163,192,139,187,134,111,146,179,145,182,150,146,198,124,145,130,{"$nulls":58},59,null,"M"]
["Kraus"," Reiner","070/18","Wellenmacher 2","HL",{"v":5889,"d":"5,889"},36,{"v":163.583,"d":"163.58"},164,143,140,137,157,148,125,177,126,126,164,158,114,165,166,167,223,140,150,168,194,174,167,181,196,134,170,157,170,203,168,160,188,192,197,180,{"$nulls":72},45,null,"M"]
["Prasch"," Daniel","069/18","Wellenmacher 2","HL",{"v":5740,"d":"5,740"},33,{"v":173.939,"d":"173.94"},165,191,150,175,181,213,165,198,179,196,194,192,221,168,203,136,144,153,135,191,111,180,171,210,168,212,187,184,145,198,178,162,84,{"$nulls":75},42,null,"M"]
["Kornett"," Kerstin","106/16","Wellenmacher 2","HL",{"$f":"ROUND(SUM(I20:CU20),0)","v":{"v":13209,"d":"13,209"}},{"$f":"COUNTA(I20:CU20)","v":74},{"$f":"ROUND(AVERAGE(I20:CU20),3)","v":{"v":178.5,"d":"178.50"}},179,215,179,146,216,208,178,196,145,199,188,179,196,187,191,156,190,225,188,168,183,189,158,178,236,236,215,190,151,214,173,227,193,135,163,197,201,175,155,152,183,167,202,191,179,190,156,167,170,147,186,162,164,196,174,162,174,158,155,147,172,178,205,154,181,169,181,163,165,156,140,116,161,188,{"$nulls":34},83,null,"W"]
["Radke"," Willy","120/17","Stadt Offenbach","HL",{"v":4748,"d":"4,748"},30,{"v":158.267,"d":"158.27"},164,143,142,125,180,151,142,142,161,151,139,183,131,168,142,125,156,178,147,171,220,170,214,165,150,128,147,161,193,159,{"$nulls":78},39,null,"M"]
["Hitzel"," Dennis","055/23","Stadt Offenbach","HL",{"v":4163,"d":"4,163"},27,{"v":154.185,"d":"154.19"},189,160,173,172,145,152,168,140,158,128,141,190,119,144,171,140,211,145,138,164,150,113,142,158,169,127,156,{"$nulls":81},36,null,"M"]
["Burkart"," Klaus","280/80","Stadt Offenbach","HL",{"v":2870,"d":"2,870"},21,{"v":136.667,"d":"136.67"},154,169,145,120,134,134,125,112,195,115,153,146,130,125,128,157,116,124,153,108,127,{"$nulls":87},30,null,"M"]
["Neumann"," Andreas","421/81","Stadt Offenbach","HL",{"v":4337,"d":"4,337"},24,{"v":180.708,"d":"180.71"},192,180,118,160,215,175,214,221,196,127,212,199,216,187,192,144,226,177,209,171,156,125,165,160,{"$nulls":84},33,null,"M"]
["Kern"," Norbert","280/93","Stadt Offenbach","HL",{"$f":"ROUND(SUM(I25:CU25),0)","v":{"v":4782,"d":"4,782"}},{"$f":"COUNTA(I25:CU25)","v":27},{"$f":"ROUND(AVERAGE(I25:CU25),3)","v":{"v":177.111,"d":"177.11"}},242,179,156,165,161,155,173,205,176,214,158,179,223,131,161,175,169,193,169,157,155,173,176,193,150,188,206,{"$nulls":81},36,null,"M"]
["Nothe"," Aleksandra","078/19","Stadt Offenbach","HL",{"v":1732,"d":"1,732"},15,{"v":115.467,"d":"115.47"},107,134,128,118,109,96,122,109,108,115,109,128,102,141,106,{"$nulls":93},24,null,"W"]
["Schließmann"," Michael","061/13","Wellenmacher 3","HL",{"v":6943,"d":"6,943"},42,165.31,158,156,161,183,155,169,189,210,194,185,217,144,180,132,137,167,191,193,172,145,160,150,163,216,160,204,157,168,181,132,172,167,133,163,113,144,133,147,211,156,138,137,{"$nulls":66},51,null,"M"]
["Trost"," Monika","124/92","Wellenmacher 3","HL",{"v":4134,"d":"4,134"},27,{"v":153.111,"d":"153.11"},155,133,119,153,157,150,152,163,183,149,164,159,156,192,165,157,133,151,159,147,160,122,179,166,145,126,139,{"$nulls":81},36,null,"W"]
["Müller"," Norbert","025/20","Wellenmacher 3","HL",{"v":11263,"d":"11,263"},68,{"v":165.632,"d":"165.63"},123,146,149,138,225,161,179,156,199,146,169,160,153,126,170,149,158,155,182,149,169,173,213,194,209,156,166,210,183,158,198,179,168,150,171,144,149,173,168,136,135,158,152,170,137,167,138,157,208,212,157,131,170,153,166,166,169,192,106,169,178,208,204,142,182,122,142,212,{"$nulls":40},77,null,"M"]
["Sabo"," Ivan","360/83","Wellenmacher 3","HL",{"v":14537,"d":"14,537"},80,{"v":181.713,"d":"181.71"},210,154,170,186,222,227,179,211,170,177,155,209,154,223,180,174,164,180,192,171,204,167,192,192,183,136,158,166,155,188,167,215,159,158,189,182,171,152,156,177,225,214,158,158,204,168,176,190,190,211,150,171,185,164,176,202,140,210,240,238,201,192,178,179,174,159,189,191,201,160,222,168,189,177,155,191,211,154,145,156,{"$nulls":28},89,null,"M"]
["Viel"," Christine","190/98","Wellenmacher 3","HL",{"$f":"ROUND(SUM(I31:CU31),0)","v":{"v":6311,"d":"6,311"}},{"$f":"COUNTA(I31:CU31)","v":39},{"$f":"ROUND(AVERAGE(I31:CU31),3)","v":{"v":161.821,"d":"161.82"}},155,150,122,151,193,160,185,177,153,149,136,144,173,155,160,142,145,172,200,184,146,148,184,180,150,133,155,171,180,143,149,170,148,140,167,185,179,179,198,{"$nulls":69},48,null,"W"]
["Winter"," Asko","011/23","MM Bau 2","HL",{"v":8325,"d":"8,325"},45,{"v":185,"d":"185.00"},200,148,167,185,178,191,169,209,197,169,152,138,195,183,226,178,188,167,191,212,210,221,193,148,174,185,160,214,155,191,209,211,150,168,216,235,207,203,154,189,174,183,153,190,189,{"$nulls":63},54,null,"M"]
["Rahner"," Viktor","107/17","MM Bau 2","HL",{"v":4920,"d":"4,920"},30,{"v":164,"d":"164.00"},158,222,143,234,161,151,126,153,153,147,181,174,177,144,139,164,158,167,162,182,124,235,169,136,156,177,184,144,129,170,{"$nulls":78},39,null,"M"]
["Capizzi"," Nunzio","242/93","MM Bau 2","HL",{"v":5044,"d":"5,044"},34,{"v":148.353,"d":"148.35"},126,146,143,114,137,162,148,144,164,169,148,148,144,152,138,149,134,135,125,148,166,145,171,124,130,173,144,153,132,175,189,162,144,162,{"$nulls":74},43,null,"M"]
["Mader"," Gaby","121/12","MM Bau 2","HL",{"v":9252,"d":"9,252"},59,{"v":156.814,"d":"156.81"},124,130,110,135,150,143,186,143,157,140,150,144,206,176,157,159,137,178,155,160,150,159,178,179,185,198,140,156,147,161,138,212,168,151,152,156,123,203,166,134,181,169,170,130,147,151,136,160,148,161,157,148,152,166,134,157,169,163,157,{"$nulls":49},68,null,"W"]
["Schubert"," Mike","106/15","MM Bau 2","HL",{"$f":"ROUND(SUM(I36:CU36),0)","v":{"v":6323,"d":"6,323"}},{"$f":"COUNTA(I36:CU36)","v":39},{"$f":"ROUND(AVERAGE(I36:CU36),3)","v":{"v":162.128,"d":"162.13"}},177,116,178,175,158,203,193,184,193,235,201,192,163,160,140,145,147,180,159,154,186,174,158,158,133,149,199,157,178,21,null,146,182,141,168,154,190,143,134,99,{"$nulls":68},48,null,"M"]
["Hamann"," Andreas","111/11","Lufthansa AirPlus","HL",{"v":4465,"d":"4,465"},30,{"v":148.833,"d":"148.83"},118,169,157,139,115,150,116,149,137,117,150,116,159,164,166,164,142,165,190,142,146,172,131,156,134,170,167,151,134,179,{"$nulls":78},39,null,"M"]
["Rülker"," Jana","165/08","Lufthansa AirPlus","HL",{"v":4068,"d":"4,068"},30,{"v":135.6,"d":"135.60"},129,143,137,126,169,112,135,97,148,141,136,133,143,101,148,179,111,115,106,143,122,176,198,151,115,132,155,123,126,118,{"$nulls":78},39,null,"W"]
["Rzepka"," Dominik","072/23","Lufthansa AirPlus","HL",{"v":3009,"d":"3,009"},24,{"v":125.375,"d":"125.38"},120,112,95,165,128,125,84,143,133,109,113,125,154,121,136,124,122,145,125,109,115,124,146,136,{"$nulls":84},33,null,"M"]
["Burghagen"," Frank","127/97","Lufthansa AirPlus","HL",{"v":9789,"d":"9,789"},57,{"v":171.737,"d":"171.74"},209,209,147,163,155,162,174,170,149,156,176,185,215,184,183,180,180,236,156,178,119,170,175,181,188,209,161,190,160,147,159,191,180,183,189,170,191,160,157,185,125,173,132,137,215,157,192,160,161,169,153,180,160,182,192,110,159,{"$nulls":51},66,null,"M"]
["Meyer"," Carsten","174/09","Lufthansa AirPlus","HL",{"v":5925,"d":"5,925"},42,{"v":141.071,"d":"141.07"},113,151,159,177,118,115,121,158,138,130,166,168,137,128,147,158,142,139,167,145,149,148,160,202,122,112,152,191,154,160,107,139,129,111,125,138,122,134,116,115,126,136,{"$nulls":66},51,null,"M"]
["Baro"," Dirk","059/13","Wellenmacher 2","Hl",{"$f":"ROUND(SUM(I42:CU42),0)","v":{"v":10469,"d":"10,469"}},{"$f":"COUNTA(I42:CU42)","v":62},{"$f":"ROUND(AVERAGE(I42:CU42),3)","v":{"v":168.855,"d":"168.86"}},195,150,141,194,165,153,164,140,222,164,193,156,147,130,160,174,153,197,163,171,165,151,161,151,178,216,195,177,194,237,147,178,212,176,152,158,147,163,182,177,169,164,159,143,156,174,177,150,143,192,172,148,179,175,146,172,170,182,161,172,134,182,{"$nulls":46},71,null,"M"]
["Schmidt"," Markus","105/23","Gassenhauer","Hl",{"v":5358,"d":"5,358"},30,{"v":178.6,"d":"178.60"},179,183,159,188,202,160,181,208,176,185,215,173,181,215,197,175,166,178,202,142,145,150,143,182,167,213,139,197,192,165,{"$nulls":78},39,null,"M"]
["Kehr"," Marco","093/23","Wellenmacher 1","HL",{"v":4049,"d":"4,049"},21,192.81,222,197,152,203,203,162,162,165,197,279,213,154,206,218,191,208,278,168,158,143,170,{"$nulls":87},30,null,"M"]
["Keller"," Claudia","162/04","Wellenmacher 1","HL",{"v":7974,"d":"7,974"},51,{"v":156.353,"d":"156.35"},187,127,121,160,121,180,132,225,166,135,169,171,147,179,136,167,110,176,132,149,132,196,148,171,206,186,159,150,177,192,187,181,169,180,160,169,124,135,159,147,191,151,117,154,144,170,135,113,132,130,119,{"$nulls":57},60,null,"W"]
["Keller"," Andreas","169/01","Wellenmacher 1","HL",{"$f":"ROUND(SUM(I46:CU46),0)","v":{"v":4983,"d":"4,983"}},{"$f":"COUNTA(I46:CU46)","v":36},{"$f":"ROUND(AVERAGE(I46:CU46),3)","v":{"v":138.417,"d":"138.42"}},137,158,136,111,131,137,132,126,137,162,120,144,123,138,117,116,134,155,153,127,152,187,160,154,117,109,120,129,133,115,141,153,170,173,134,142,{"$nulls":72},45,null,"M"]
["Sperling","Alfred","171/01","Wellenmacher 2","HL",{"$f":"ROUND(SUM(I47:CU47),0)","v":{"v":10955,"d":"10,955"}},{"$f":"COUNTA(I47:CU47)","v":64},{"$f":"ROUND(AVERAGE(I47:CU47),3)","v":{"v":171.172,"d":"171.17"}},155,151,157,162,176,158,149,158,200,140,244,164,194,150,193,216,126,165,161,171,181,203,160,147,146,188,170,224,156,198,117,189,170,198,254,189,210,183,169,150,172,183,154,168,202,190,139,136,151,196,160,187,175,170,185,180,194,183,144,142,143,143,124,142,{"$nulls":44},73,null,"M"]
["Malow"," Christine","125/12","MM Bau 2","HL",{"$f":"ROUND(SUM(I48:CU48),0)","v":{"v":6303,"d":"6,303"}},{"$f":"COUNTA(I48:CU48)","v":32},{"v":196.969,"d":"196.97"},200,215,217,203,182,204,226,195,147,170,257,199,168,203,202,156,199,232,190,252,184,203,195,178,196,182,242,152,189,213,202,150,{"$nulls":76},41,null,"W"]
["Hoffmann"," René","075/13","Stadt Offenbach","HL",{"v":1551,"d":"1,551"},12,129.25,112,136,120,118,161,115,128,111,125,150,128,147,{"$nulls":96},21,null,"M"]
["Hoffmann"," Sabrina","122/15","Stadt Offenbach","HL",{"v":1297,"d":"1,297"},12,{"v":108.083,"d":"108.08"},94,100,119,112,139,90,112,131,104,91,98,107,{"$nulls":96},21,null,"W"]
["Schaack"," Madelaine","066/18","Stadt Offenbach","HL",{"v":1532,"d":"1,532"},15,{"v":102.133,"d":"102.13"},81,92,108,92,111,108,80,120,107,127,78,98,100,107,123,{"$nulls":93},24,null,"W"]
["Bönsch"," Siegfried","082/08","Stadt Offenbach","HL",{"$f":"ROUND(SUM(I52:CU52),0)","v":725},{"$f":"COUNTA(I52:CU52)","v":6},{"$f":"ROUND(AVERAGE(I52:CU52),3)","v":{"v":120.833,"d":"120.83"}},122,122,122,129,114,116,{"$nulls":102},15,null,"M"]
["Gebauer"," Christian","130/15","Lufthansa AirPlus","HL",{"$f":"ROUND(SUM(I53:CU53),0)","v":372},{"$f":"COUNTA(I53:CU53)","v":3},{"$f":"ROUND(AVERAGE(I53:CU53),3)","v":{"v":124,"d":"124.00"}},141,107,124,{"$nulls":105},12,null,"M"]
["Mader"," Sven","082/19","MM Bau 1","HL",{"v":2546,"d":"2,546"},12,{"v":212.167,"d":"212.17"},179,222,241,201,191,246,189,246,204,234,219,174,{"$nulls":96},21,null,"M"]
["Pisciaroli"," Sven","019/12","Wellenmacher 3","HL",{"$f":"ROUND(SUM(I55:CU55),0)","v":{"v":1535,"d":"1,535"}},{"$f":"COUNTA(I55:CU55)","v":9},{"$f":"ROUND(AVERAGE(I55:CU55),3)","v":{"v":170.556,"d":"170.56"}},179,162,210,172,170,171,147,143,181,{"$nulls":99},18,null,"M"]

{"sheet":"Rang","index":1,"n_rows":63,"n_cols":12,"rows_kept":63}
["Rang neu","Rang\nalt","Name","Vorname","Pass-Nr","Saison 2023/2024\nTeam","Klasse","Pins ges.","Spiele","Schnitt","Filtername","G"]
[]
[1,1,"Mader"," Sven","082/19","MM Bau 1","HL",2546,12,{"v":212.167,"d":"212.17"},{"$f":"C3&\",\"&D3","v":"Mader, Sven"},"M"]
[2,3,"Gehrmann"," René","063/14","Wellenmacher 1","HL",12386,62,{"v":199.774,"d":"199.77"},{"$f":"C4&\",\"&D4","v":"Gehrmann, René"},"M"]
[3,2,"Malow"," Christine","125/12","MM Bau 2","HL",6303,32,{"v":196.969,"d":"196.97"},{"$f":"C5&\",\"&D5","v":"Malow, Christine"},"W"]
[4,4,"Malow"," Marco","101/15","MM Bau 1","HL",16311,83,{"v":196.518,"d":"196.52"},{"$f":"C6&\",\"&D6","v":"Malow, Marco"},"M"]
[5,6,"Scharnowski"," Waldemar","127/94","Wellenmacher 1","HL",8812,45,{"v":195.822,"d":"195.82"},{"$f":"C7&\",\"&D7","v":"Scharnowski, Waldemar"},"M"]
[6,5,"Kehr"," Marco","093/23","Wellenmacher 1","HL",4049,21,192.81,{"$f":"C8&\",\"&D8","v":"Kehr, Marco"},"M"]
[7,7,"Haase"," Reiner","104/15","MM Bau 1","HL",10277,54,{"v":190.315,"d":"190.32"},{"$f":"C9&\",\"&D9","v":"Haase, Reiner"},"M"]
[8,8,"Harzer"," Christopher","030/16","Gassenhauer","HL",10064,54,186.37,{"$f":"C10&\",\"&D10","v":"Harzer, Christopher"},"M"]
[9,11,"Kiefer"," Michael","029/08","Gassenhauer","HL",15369,83,{"v":185.169,"d":"185.17"},{"$f":"C11&\",\"&D11","v":"Kiefer, Michael"},"M"]
[10,10,"Winter"," Asko","011/23","MM Bau 2","HL",8325,45,{"v":185,"d":"185.00"},{"$f":"C12&\",\"&D12","v":"Winter, Asko"},"M"]
[11,12,"Sabo"," Ivan","360/83","Wellenmacher 3","HL",14537,80,{"v":181.713,"d":"181.71"},{"$f":"C13&\",\"&D13","v":"Sabo, Ivan"},"M"]
[12,9,"Neumann"," Andreas","421/81","Stadt Offenbach","HL",4337,24,{"v":180.708,"d":"180.71"},{"$f":"C14&\",\"&D14","v":"Neumann, Andreas"},"M"]
[13,14,"Schmidt"," Markus","105/23","Gassenhauer","Hl",5358,30,{"v":178.6,"d":"178.60"},{"$f":"C15&\",\"&D15","v":"Schmidt, Markus"},"M"]
[14,13,"Kornett"," Kerstin","106/16","Wellenmacher 2","HL",13209,74,{"v":178.5,"d":"178.50"},{"$f":"C16&\",\"&D16","v":"Kornett, Kerstin"},"W"]
[15,17,"Kern"," Norbert","280/93","Stadt Offenbach","HL",4782,27,{"v":177.111,"d":"177.11"},{"$f":"C17&\",\"&D17","v":"Kern, Norbert"},"M"]
[16,16,"Vorwerg"," Michael","083/14","Gassenhauer","HL",10551,60,175.85,{"$f":"C18&\",\"&D18","v":"Vorwerg, Michael"},"M"]
[17,18,"Lella"," Michele","059/14","Gassenhauer","HL",6273,36,174.25,{"$f":"C19&\",\"&D19","v":"Lella, Michele"},"M"]
[18,15,"Prasch"," Daniel","069/18","Wellenmacher 2","HL",5740,33,{"v":173.939,"d":"173.94"},{"$f":"C20&\",\"&D20","v":"Prasch, Daniel"},"M"]
[19,20,"Burghagen"," Frank","127/97","Lufthansa AirPlus","HL",9789,57,{"v":171.737,"d":"171.74"},{"$f":"C21&\",\"&D21","v":"Burghagen, Frank"},"M"]
[20,19,"Sperling","Alfred","171/01","Wellenmacher 2","HL",10955,64,{"v":171.172,"d":"171.17"},{"$f":"C22&\",\"&D22","v":"Sperling,Alfred"},"M"]
[21,22,"Pisciaroli"," Sven","019/12","Wellenmacher 3","HL",1535,9,{"v":170.556,"d":"170.56"},{"$f":"C23&\",\"&D23","v":"Pisciaroli, Sven"},"M"]
[22,21,"Vogel"," Bernd","122/12","MM Bau 1","HL",7659,45,{"v":170.2,"d":"170.20"},{"$f":"C24&\",\"&D24","v":"Vogel, Bernd"},"M"]
[23,23,"Baro"," Dirk","059/13","Wellenmacher 2","Hl",10469,62,{"v":168.855,"d":"168.86"},{"$f":"C25&\",\"&D25","v":"Baro, Dirk"},"M"]
[24,24,"Brookes-Kiefer"," Elaine","028/08","Gassenhauer","HL",10951,65,{"v":168.477,"d":"168.48"},{"$f":"C26&\",\"&D26","v":"Brookes-Kiefer, Elaine"},"W"]
[25,25,"Koths"," Katrin","105/16","Wellenmacher 1","HL",7855,47,{"v":167.128,"d":"167.13"},{"$f":"C27&\",\"&D27","v":"Koths, Katrin"},"W"]
[26,27,"Müller"," Norbert","025/20","Wellenmacher 3","HL",11263,68,{"v":165.632,"d":"165.63"},{"$f":"C28&\",\"&D28","v":"Müller, Norbert"},"M"]
[27,26,"Schließmann"," Michael","061/13","Wellenmacher 3","HL",6943,42,165.31,{"$f":"C29&\",\"&D29","v":"Schließmann, Michael"},"M"]
[28,28,"Rahner"," Viktor","107/17","MM Bau 2","HL",4920,30,{"v":164,"d":"164.00"},{"$f":"C30&\",\"&D30","v":"Rahner, Viktor"},"M"]
[29,30,"Kraus"," Reiner","070/18","Wellenmacher 2","HL",5889,36,{"v":163.583,"d":"163.58"},{"$f":"C31&\",\"&D31","v":"Kraus, Reiner"},"M"]
[30,29,"Schubert"," Mike","106/15","MM Bau 2","HL",6323,39,{"v":162.128,"d":"162.13"},{"$f":"C32&\",\"&D32","v":"Schubert, Mike"},"M"]
[31,31,"Viel"," Christine","190/98","Wellenmacher 3","HL",6311,39,{"v":161.821,"d":"161.82"},{"$f":"C33&\",\"&D33","v":"Viel, Christine"},"W"]
[32,32,"Brückner"," Sylvia","102/23","MM Bau 1","HL",5805,36,161.25,{"$f":"C34&\",\"&D34","v":"Brückner, Sylvia"},"W"]
[33,33,"Fabian"," Ingo","064/14","Wellenmacher 1","HL",1925,12,{"v":160.417,"d":"160.42"},{"$f":"C35&\",\"&D35","v":"Fabian, Ingo"},"M"]
[34,34,"Roth"," Horst","092/17","Wellenmacher 2","HL",7920,50,{"v":158.4,"d":"158.40"},{"$f":"C36&\",\"&D36","v":"Roth, Horst"},"M"]
[35,35,"Radke"," Willy","120/17","Stadt Offenbach","HL",4748,30,{"v":158.267,"d":"158.27"},{"$f":"C37&\",\"&D37","v":"Radke, Willy"},"M"]
[36,37,"Brötz"," Heinz","090/22","MM Bau 1","HL",945,6,{"v":157.5,"d":"157.50"},{"$f":"C38&\",\"&D38","v":"Brötz, Heinz"},"M"]
[37,38,"Mader"," Gaby","121/12","MM Bau 2","HL",9252,59,{"v":156.814,"d":"156.81"},{"$f":"C39&\",\"&D39","v":"Mader, Gaby"},"W"]
[38,36,"Keller"," Claudia","162/04","Wellenmacher 1","HL",7974,51,{"v":156.353,"d":"156.35"},{"$f":"C40&\",\"&D40","v":"Keller, Claudia"},"W"]
[39,39,"Hitzel"," Dennis","055/23","Stadt Offenbach","HL",4163,27,{"v":154.185,"d":"154.19"},{"$f":"C41&\",\"&D41","v":"Hitzel, Dennis"},"M"]
[40,40,"Trost"," Monika","124/92","Wellenmacher 3","HL",4134,27,{"v":153.111,"d":"153.11"},{"$f":"C42&\",\"&D42","v":"Trost, Monika"},"W"]
[41,41,"Hamann"," Andreas","111/11","Lufthansa AirPlus","HL",4465,30,{"v":148.833,"d":"148.83"},{"$f":"C43&\",\"&D43","v":"Hamann, Andreas"},"M"]
[42,42,"Capizzi"," Nunzio","242/93","MM Bau 2","HL",5044,34,{"v":148.353,"d":"148.35"},{"$f":"C44&\",\"&D44","v":"Capizzi, Nunzio"},"M"]
[43,43,"Lipke"," Roswitha","118/11","Wellenmacher 2","HL",6482,44,{"v":147.318,"d":"147.32"},{"$f":"C45&\",\"&D45","v":"Lipke, Roswitha"},"W"]
[44,44,"Meyer"," Carsten","174/09","Lufthansa AirPlus","HL",5925,42,{"v":141.071,"d":"141.07"},{"$f":"C46&\",\"&D46","v":"Meyer, Carsten"},"M"]
[45,45,"Keller"," Andreas","169/01","Wellenmacher 1","HL",4983,36,{"v":138.417,"d":"138.42"},{"$f":"C47&\",\"&D47","v":"Keller, Andreas"},"M"]
[46,46,"Burkart"," Klaus","280/80","Stadt Offenbach","HL",2870,21,{"v":136.667,"d":"136.67"},{"$f":"C48&\",\"&D48","v":"Burkart, Klaus"},"M"]
[47,47,"Rülker"," Jana","165/08","Lufthansa AirPlus","HL",4068,30,{"v":135.6,"d":"135.60"},{"$f":"C49&\",\"&D49","v":"Rülker, Jana"},"W"]
[48,48,"Hoffmann"," René","075/13","Stadt Offenbach","HL",1551,12,129.25,{"$f":"C50&\",\"&D50","v":"Hoffmann, René"},"M"]
[49,49,"Rzepka"," Dominik","072/23","Lufthansa AirPlus","HL",3009,24,{"v":125.375,"d":"125.38"},{"$f":"C51&\",\"&D51","v":"Rzepka, Dominik"},"M"]
[50,50,"Gebauer"," Christian","130/15","Lufthansa AirPlus","HL",372,3,{"v":124,"d":"124.00"},{"$f":"C52&\",\"&D52","v":"Gebauer, Christian"},"M"]
[51,51,"Bönsch"," Siegfried","082/08","Stadt Offenbach","HL",725,6,{"v":120.833,"d":"120.83"},{"$f":"C53&\",\"&D53","v":"Bönsch, Siegfried"},"M"]
[52,52,"Nothe"," Aleksandra","078/19","Stadt Offenbach","HL",1732,15,{"v":115.467,"d":"115.47"},{"$f":"C54&\",\"&D54","v":"Nothe, Aleksandra"},"W"]
[53,53,"Hoffmann"," Sabrina","122/15","Stadt Offenbach","HL",1297,12,{"v":108.083,"d":"108.08"},{"$f":"C55&\",\"&D55","v":"Hoffmann, Sabrina"},"W"]
[54,54,"Schaack"," Madelaine","066/18","Stadt Offenbach","HL",1532,15,{"v":102.133,"d":"102.13"},{"$f":"C56&\",\"&D56","v":"Schaack, Madelaine"},"W"]
[{"$nulls":10},{"$f":"C57&\",\"&D57","v":","},"W"]
[{"$nulls":10},{"$f":"C58&\",\"&D58","v":","},"M"]
[{"$nulls":10},",","M"]
[{"$nulls":10},",","M"]
[{"$nulls":10},",","W"]
[{"$nulls":10},",","W"]
[{"$nulls":10},",","W"]

{"sheet":"Abfragen","index":2,"n_rows":224,"n_cols":14,"rows_kept":224,"merged":[[2,7,3,8],[2,13,3,14],[5,7,6,8],[5,13,6,14],[8,7,9,8]]}
[]
[]
[{"$nulls":7},"Mannschaften",{"$nulls":5},"Spielernamen"]
[]
[]
[{"$nulls":7},"BSG's",{"$nulls":5},"Geschlecht"]
[]
[]
[{"$nulls":7},"Klassen"]
[]
[]
[]
[1,2,"Gassenhauer",null,2,"HL",2,"Baro, Dirk",{"$f":"IF(A13>1,VLOOKUP(A13,B13:C40,2,0),\"N\")","v":"N"},2,"M"]
[1,3,"Lufthansa AirPlus",null,3,"HL",3,"Bönsch, Siegfried",{"$f":"IF(A14>1,VLOOKUP(A14,E13:F17,2,0),\"N\")","v":"N"},3,"W"]
[1,4,"MM Bau 1",null,4,"HL",4,"Brookes-Kiefer, Elaine",{"$f":"IF(A15>1,VLOOKUP(A15,G13:H200,2,0),\"N\")","v":"N"}]
[1,5,"MM Bau 2",null,5,null,5,"Brötz, Heinz",{"$f":"IF(A16>1,VLOOKUP(A16,J13:K14,2,0),\"N\")","v":"N"}]
[1,6,"Stadt Offenbach",null,6,null,6,"Brückner, Sylvia",{"$f":"IF(A17>1,VLOOKUP(A17,B44:C49,2,0),\"N\")","v":"N"}]
[null,7,"Wellenmacher 1",{"$nulls":3},7,"Burghagen, Frank"]
[null,8,"Wellenmacher 2",{"$nulls":3},8,"Burkart, Klaus"]
[null,9,"Wellenmacher 3",{"$nulls":3},9,"Capizzi, Nunzio"]
[null,10,{"$nulls":4},10,"Fabian, Ingo"]
[null,11,{"$nulls":4},11,"Gebauer, Christian"]
[null,12,{"$nulls":4},12,"Gehrmann, René"]
[null,13,{"$nulls":4},13,"Haase, Reiner"]
[null,14,{"$nulls":4},14,"Hamann, Andreas"]
[null,15,{"$nulls":4},15,"Harzer, Christopher"]
[null,16,{"$nulls":4},16,"Hitzel, Dennis"]
[null,17,{"$nulls":4},17,"Hoffmann, René"]
[null,18,{"$nulls":4},18,"Hoffmann, Sabrina"]
[null,19,{"$nulls":4},19,"Kehr, Marco"]
[null,20,{"$nulls":4},20,"Keller, Andreas"]
[null,21,{"$nulls":4},21,"Keller, Claudia"]
[null,22,{"$nulls":4},22,"Kern, Norbert"]
[null,23,{"$nulls":4},23,"Kiefer, Michael"]
[null,24,{"$nulls":4},24,"Kornett, Kerstin"]
[null,25,{"$nulls":4},25,"Koths, Katrin"]
[null,26,{"$nulls":4},26,"Kraus, Reiner"]
[null,27,{"$nulls":4},27,"Lella, Michele"]
[null,28,{"$nulls":4},28,"Lipke, Roswitha"]
[null,29,{"$nulls":4},29,"Mader, Gaby"]
[{"$nulls":6},30,"Mader, Sven"]
[{"$nulls":6},31,"Malow, Christine"]
[{"$nulls":6},32,"Malow, Marco"]
[null,2,"MM Bau",{"$nulls":3},33,"Meyer, Carsten"]
[null,3,"Wellenmacher",{"$nulls":3},34,"Müller, Norbert"]
[null,4,{"$nulls":4},35,"Neumann, Andreas"]
[null,5,{"$nulls":4},36,"Nothe, Aleksandra"]
[null,6,{"$nulls":4},37,"Pisciaroli, Sven"]
[null,7,{"$nulls":4},38,"Prasch, Daniel"]
[{"$nulls":6},39,"Radke, Willy"]
[{"$nulls":6},40,"Rahner, Viktor"]
[{"$nulls":6},41,"Roth, Horst"]
[{"$nulls":6},42,"Rülker, Jana"]
[{"$nulls":6},43,"Rzepka, Dominik"]
[{"$nulls":6},44,"Sabo, Ivan"]
[{"$nulls":6},45,"Schaack, Madelaine"]
[{"$nulls":6},46,"Scharnowski, Waldemar"]
[{"$nulls":6},47,"Schließmann, Michael"]
[{"$nulls":6},48,"Schmidt, Markus"]
[{"$nulls":6},49,"Schubert, Mike"]
[{"$nulls":6},50,"Sperling,Alfred"]
[{"$nulls":6},51,"Trost, Monika"]
[{"$nulls":6},52,"Viel, Christine"]
[{"$nulls":6},53,"Vogel, Bernd"]
[{"$nulls":6},54,"Vorwerg, Michael"]
[{"$nulls":6},55,"Winter, Asko"]
[{"$nulls":6},56]
[{"$nulls":6},57]
[{"$nulls":6},58]
[{"$nulls":6},59]
[{"$nulls":6},60]
[{"$nulls":6},61]
[{"$nulls":6},62]
[{"$nulls":6},63]
[{"$nulls":6},64]
[{"$nulls":6},65]
[{"$nulls":6},66]
[{"$nulls":6},67]
[{"$nulls":6},68]
[{"$nulls":6},69]
[{"$nulls":6},70]
[{"$nulls":6},71]
[{"$nulls":6},72]
[{"$nulls":6},73]
[{"$nulls":6},74]
[{"$nulls":6},75]
[{"$nulls":6},76]
[{"$nulls":6},77]
[{"$nulls":6},78]
[{"$nulls":6},79]
[{"$nulls":6},80]
[{"$nulls":6},81]
[{"$nulls":6},82]
[{"$nulls":6},83]
[{"$nulls":6},84]
[{"$nulls":6},85]
[{"$nulls":6},86]
[{"$nulls":6},87]
[{"$nulls":6},88]
[{"$nulls":6},89]
[{"$nulls":6},90]
[{"$nulls":6},91]
[{"$nulls":6},92]
[{"$nulls":6},93]
[{"$nulls":6},94]
[{"$nulls":6},95]
[{"$nulls":6},96]
[{"$nulls":6},97]
[{"$nulls":6},98]
[{"$nulls":6},99]
[{"$nulls":6},100]
[{"$nulls":6},101]
[{"$nulls":6},102]
[{"$nulls":6},103]
[{"$nulls":6},104]
[{"$nulls":6},105]
[{"$nulls":6},106]
[{"$nulls":6},107]
[{"$nulls":6},108]
[{"$nulls":6},109]
[{"$nulls":6},110]
[{"$nulls":6},111]
[{"$nulls":6},112]
[{"$nulls":6},113]
[{"$nulls":6},114]
[{"$nulls":6},115]
[{"$nulls":6},116]
[{"$nulls":6},117]
[{"$nulls":6},118]
[{"$nulls":6},119]
[{"$nulls":6},120]
[{"$nulls":6},121]
[{"$nulls":6},122]
[{"$nulls":6},123]
[{"$nulls":6},124]
[{"$nulls":6},125]
[{"$nulls":6},126]
[{"$nulls":6},127]
[{"$nulls":6},128]
[{"$nulls":6},129]
[{"$nulls":6},130]
[{"$nulls":6},131]
[{"$nulls":6},132]
[{"$nulls":6},133]
[{"$nulls":6},134]
[{"$nulls":6},135]
[{"$nulls":6},136]
[{"$nulls":6},137]
[{"$nulls":6},138]
[{"$nulls":6},139]
[{"$nulls":6},140]
[{"$nulls":6},141]
[{"$nulls":6},142]
[{"$nulls":6},143]
[{"$nulls":6},144]
[{"$nulls":6},145]
[{"$nulls":6},146]
[{"$nulls":6},147]
[{"$nulls":6},148]
[{"$nulls":6},149]
[{"$nulls":6},150]
[{"$nulls":6},151]
[{"$nulls":6},152]
[{"$nulls":6},153]
[{"$nulls":6},154]
[{"$nulls":6},155]
[{"$nulls":6},156]
[{"$nulls":6},157]
[{"$nulls":6},158]
[{"$nulls":6},159]
[{"$nulls":6},160]
[{"$nulls":6},161]
[{"$nulls":6},162]
[{"$nulls":6},163]
[{"$nulls":6},164]
[{"$nulls":6},165]
[{"$nulls":6},166]
[{"$nulls":6},167]
[{"$nulls":6},168]
[{"$nulls":6},169]
[{"$nulls":6},170]
[{"$nulls":6},171]
[{"$nulls":6},172]
[{"$nulls":6},173]
[{"$nulls":6},174]
[{"$nulls":6},175]
[{"$nulls":6},176]
[{"$nulls":6},177]
[{"$nulls":6},178]
[{"$nulls":6},179]
[{"$nulls":6},180]
[]
[]
[]
[]
[{"$nulls":6},181]
[{"$nulls":6},182]
[{"$nulls":6},183]
[{"$nulls":6},184]
[{"$nulls":6},185]
[{"$nulls":6},186]
[{"$nulls":6},187]
[{"$nulls":6},188]
[{"$nulls":6},189]
[{"$nulls":6},190]
[{"$nulls":6},191]
[{"$nulls":6},192]
[{"$nulls":6},193]
[{"$nulls":6},194]
[{"$nulls":6},195]
[{"$nulls":6},196]
[{"$nulls":6},197]
[{"$nulls":6},198]
[{"$nulls":6},199]
[{"$nulls":6},200]
[{"$nulls":6},201]
[{"$nulls":6},202]
[{"$nulls":6},203]
[{"$nulls":6},204]
[{"$nulls":6},205]
[{"$nulls":6},206]
[{"$nulls":6},207]
[{"$nulls":6},208]
[{"$nulls":6},209]

{"sheet":"Makros","index":3,"n_rows":0,"n_cols":0,"rows_kept":0,"hidden":true}